Error:11:25:12.400 [ERROR] [org.gradle.BuildExceptionReporter]
11:25:12.401 [ERROR] [org.gradle.BuildExceptionReporter] **FAILURE: Build failed with an exception.**
11:25:12.401 [ERROR] [org.gradle.BuildExceptionReporter]
11:25:12.401 [ERROR] [org.gradle.BuildExceptionReporter] * **What went wrong:**
11:25:12.401 [ERROR] [org.gradle.BuildExceptionReporter] **java.lang.NullPointerException (no error message)**
11:25:12.401 [ERROR] [org.gradle.BuildExceptionReporter]
11:25:12.401 [ERROR] [org.gradle.BuildExceptionReporter] *** Exception is:**
11:25:12.401 [ERROR] [org.gradle.BuildExceptionReporter] **java.lang.NullPointerException**
11:25:12.401 [ERROR] [org.gradle.BuildExceptionReporter] at org.gradle.api.internal.changedetection.state.TreeSnapshotRepository.removeTreeSnapshotUsage(TreeSnapshotRepository.java:85)
11:25:12.401 [ERROR] [org.gradle.BuildExceptionReporter] at org.gradle.api.internal.changedetection.state.CacheBackedFileSnapshotRepository.remove(CacheBackedFileSnapshotRepository.java:47)
11:25:12.401 [ERROR] [org.gradle.BuildExceptionReporter] at org.gradle.api.internal.changedetection.state.CacheBackedTaskHistoryRepository$1$1.run(CacheBackedTaskHistoryRepository.java:84)
11:25:12.401 [ERROR] [org.gradle.BuildExceptionReporter] at org.gradle.internal.Factories$1.create(Factories.java:22)
11:25:12.401 [ERROR] [org.gradle.BuildExceptionReporter] at org.gradle.cache.internal.DefaultCacheAccess.useCache(DefaultCacheAccess.java:192)
11:25:12.401 [ERROR] [org.gradle.BuildExceptionReporter] at org.gradle.cache.internal.DefaultCacheAccess.useCache(DefaultCacheAccess.java:175)
11:25:12.401 [ERROR] [org.gradle.BuildExceptionReporter] at org.gradle.cache.internal.DefaultPersistentDirectoryStore.useCache(DefaultPersistentDirectoryStore.java:106)
11:25:12.401 [ERROR] [org.gradle.BuildExceptionReporter] at org.gradle.cache.internal.DefaultCacheFactory$ReferenceTrackingCache.useCache(DefaultCacheFactory.java:187)
11:25:12.402 [ERROR] [org.gradle.BuildExceptionReporter] at org.gradle.api.internal.changedetection.state.DefaultTaskArtifactStateCacheAccess.useCache(DefaultTaskArtifactStateCacheAccess.java:60)
11:25:12.402 [ERROR] [org.gradle.BuildExceptionReporter] at org.gradle.api.internal.changedetection.state.CacheBackedTaskHistoryRepository$1.update(CacheBackedTaskHistoryRepository.java:66)
11:25:12.402 [ERROR] [org.gradle.BuildExceptionReporter] at org.gradle.api.internal.changedetection.changes.DefaultTaskArtifactStateRepository$TaskArtifactStateImpl.afterTask(DefaultTaskArtifactStateRepository.java:135)
11:25:12.402 [ERROR] [org.gradle.BuildExceptionReporter] at org.gradle.api.internal.tasks.execution.SkipUpToDateTaskExecuter.execute(SkipUpToDateTaskExecuter.java:68)
11:25:12.402 [ERROR] [org.gradle.BuildExceptionReporter] at org.gradle.api.internal.tasks.execution.ValidatingTaskExecuter.execute(ValidatingTaskExecuter.java:58)
11:25:12.402 [ERROR] [org.gradle.BuildExceptionReporter] at org.gradle.api.internal.tasks.execution.SkipEmptySourceFilesTaskExecuter.execute(SkipEmptySourceFilesTaskExecuter.java:52)
11:25:12.402 [ERROR] [org.gradle.BuildExceptionReporter] at org.gradle.api.internal.tasks.execution.SkipTaskWithNoActionsExecuter.execute(SkipTaskWithNoActionsExecuter.java:52)
11:25:12.402 [ERROR] [org.gradle.BuildExceptionReporter] at org.gradle.api.internal.tasks.execution.SkipOnlyIfTaskExecuter.execute(SkipOnlyIfTaskExecuter.java:53)
11:25:12.402 [ERROR] [org.gradle.BuildExceptionReporter] at org.gradle.api.internal.tasks.execution.ExecuteAtMostOnceTaskExecuter.execute(ExecuteAtMostOnceTaskExecuter.java:43)
11:25:12.402 [ERROR] [org.gradle.BuildExceptionReporter] at org.gradle.execution.taskgraph.DefaultTaskGraphExecuter$EventFiringTaskWorker.execute(DefaultTaskGraphExecuter.java:203)
11:25:12.402 [ERROR] [org.gradle.BuildExceptionReporter] at org.gradle.execution.taskgraph.DefaultTaskGraphExecuter$EventFiringTaskWorker.execute(DefaultTaskGraphExecuter.java:185)
11:25:12.402 [ERROR] [org.gradle.BuildExceptionReporter] at org.gradle.execution.taskgraph.AbstractTaskPlanExecutor$TaskExecutorWorker.processTask(AbstractTaskPlanExecutor.java:66)
11:25:12.402 [ERROR] [org.gradle.BuildExceptionReporter] at org.gradle.execution.taskgraph.AbstractTaskPlanExecutor$TaskExecutorWorker.run(AbstractTaskPlanExecutor.java:50)
11:25:12.402 [ERROR] [org.gradle.BuildExceptionReporter] at org.gradle.internal.concurrent.ExecutorPolicy$CatchAndRecordFailures.onExecute(ExecutorPolicy.java:54)
11:25:12.403 [ERROR] [org.gradle.BuildExceptionReporter] at org.gradle.internal.concurrent.StoppableExecutorImpl$1.run(StoppableExecutorImpl.java:40)
11:25:12.403 [ERROR] [org.gradle.BuildExceptionReporter]
答えて
この問題が発生したAndroidプロジェクトのビルド中にmacOSがクラッシュしたためにmacOSがクラッシュした後、この問題が発生しました。 これは、破損したグランドルキャッシュが原因である可能性が高いと思われます。あなたは、次の手順を実行して、この問題を解決することができます
- 閉じるAndroidのメーカー
- 実行
gradlew --stop
一切のGradleデーモンがまだあなたのプロジェクト - オープンのAndroidのルートに.gradleフォルダを削除
- を実行されていないことを確認しますStudioと
出典再構築:[のhttps://code.google.com/p/android/issues/detail?id=220741#c13
yaその後の作業は、削除してからgradleフォルダーを開いて閉じる&アンドロイドスタジオ:ありがとう – Bhuvanesh
どこで私はgradlew --stopとタイプするのですか? –
@ lancel0t in the terminal –
- 1. Java/Groovy Gradleビルドエラー
- 2. Androidスタジオgradleビルドエラー
- 3. レトロフィット2:Gradleのビルドエラー
- 4. のGradleは、ビルドエラーのAndroidメーカー
- 5. Appium/Selenium TestNG Gradle DexArchiveBulderExceptionビルドエラー
- 6. AndroidStudio 3.0のGradleビルドエラーCanary 1
- 7. AndroidスタジオのアップデートGradleをクリックした後のカンジダリングの同期 - エラー:Gradle 2.14.1にAndroid Gradleプラグイン2.1.3以降が必要
- 8. firebase依存関係のgradleビルドエラー
- 9. Travis CIがgradleとAntlrでビルドエラー
- 10. 新しいビルドgradle 2.2.2とgradle-wrapper - 2.14.1-all.zipにアップデートした後、SOファイルが認識されない
- 11. Androidプラグインfor Gradle 2.2.2とGradleバージョン2.14.1が一緒にAndroid v4をダウンロードできませんでした
- 12. Androidスタジオ - Gradleのバージョンは2.14.1です。現在のバージョンは2.10です
- 13. Android gradleビルドエラー:(10、0)Gradle DSLメソッドが見つかりません: 'compile()'
- 14. 私のlenovoアンドロイドデバイスを追加中にgradleビルドエラー
- 15. このgradleビルドエラーを削除するには?
- 16. インストール時にgradleビルドエラーが発生しました
- 17. のGradle 3.0ビルドエラー:実行タスクに失敗しました「:アプリ:transformClassesWithDesugarForDebug」
- 18. アンドロイドスタジオのデフォルトで最新版ではなくGradle 2.14.1が使用されるのはなぜですか?
- 19. Androidスタジオ2.2とグラデーション2.14.1遅い
- 20. BSOD(ブルースクリーン)した後、私は次のGradleビルドエラーを持っているのGradleはBSOD(java.lang.NullPointerExceptionが(エラーメッセージなし)の後
- 21. 私はアンドロイドスタジオ2.2.2をダウンロードしましたが、gradle 2.14.1 gradleコマンドを使ってプロジェクトをコンパイルしましたが失敗しましたか?
- 22. ビルドエラーの例ビルドエラーFlex mxml
- 23. ビルドエラー
- 24. Webpackビルドエラー
- 25. FFMPEGビルドエラー
- 26. vtkMFCビルドエラー
- 27. BizTalkビルドエラー
- 28. GEOSビルドエラー
- 29. processDebugResources:Androidビルドエラー
- 30. Vulkanビルドエラー
可能な複製を何NullPointerExceptionがあります。どうすれば修正できますか?](http://stackoverflow.com/questions/218384/what-is-a-nullpointerexception-and-how-do-i-fix-it) – Jens
編集してくださいこのエラーが表示される前に、あなたのプロジェクトで変更した内容の詳細を追加することはあなたの質問ですか?私は現在、同じ問題(同じスタックトレース)に直面しています。それは、他の共通点があるかどうかを診断するために、他にも役立ちます。 @Jens、私はこれが重複しているとは思わない、私は実際に同じ問題を抱えているので、コード自体ではなく、プロセスや設定をグラブルで作成するのが間違っているようだ。 – PseudoPsyche
私は同じ問題を抱えていて、この質問と回答が私を助けました。だから私は説明がGoogleが私をここに連れて来るのに十分だと思う。 Btw、@ Bhuvanesh、あなたは以下の答えを受け入れることができます。 – ULazdins