2017-04-10 8 views
0

Linux上でAWS CPP SDKをビルドしようとしていますが、ビルドに失敗しました(解決済みのシンボル: このエラーで誰かに光を当てることができますか? .1 STLライブラリのサポートとclang 3.8。)AWS CPP SDKを構築するときに未解決のシンボル

===============

[ RUN  ] DefaultRateLimitTest.fractionalLimitTest 
[  OK ] DefaultRateLimitTest.fractionalLimitTest (0 ms) 
[----------] 11 tests from DefaultRateLimitTest (0 ms total) 

[----------] Global test environment tear-down 
[==========] 226 tests from 33 test cases ran. (4137 ms total) 
[ PASSED ] 226 tests. 
[100%] Built target aws-cpp-sdk-core-tests 
[100%] Building CXX object aws-cpp-sdk-text-to-speech-tests/CMakeFiles/aws-cpp-sdk-text-to-speech-tests.dir/RunTests.cpp.o 
[100%] Building CXX object aws-cpp-sdk-text-to-speech-tests/CMakeFiles/aws-cpp-sdk-text-to-speech-tests.dir/TextToSpeechManagerTests.cpp.o 
[100%] Linking CXX executable aws-cpp-sdk-text-to-speech-tests 
/opt/rh/devtoolset-6/root/bin/ld: ../aws-cpp-sdk-text-to-speech/libaws-cpp-sdk-text-to-speech.a(PulseAudioPCMOutputDriver.cpp.o): undefined reference to symbol '[email protected]@PULSE_0' 
//lib64/libpulse.so.0: error adding symbols: DSO missing from command line 
clang-3.8: error: linker command failed with exit code 1 (use -v to see invocation) 
make[2]: *** [aws-cpp-sdk-text-to-speech-tests/aws-cpp-sdk-text-to-speech-tests] Error 1 
make[1]: *** [aws-cpp-sdk-text-to-speech-tests/CMakeFiles/aws-cpp-sdk-text-to-speech-tests.dir/all] Error 2 
make: *** [all] Error 2 

答えて

0

我々は最近、このためにアップデートをプッシュ。それは-lpulse欠落していました。

新鮮なプルは、問題を修正する必要があります。

関連する問題